pashazz 03.06.2010 22:39

WineGameWineGame 0.1-rc4 & Winestuff 0.1-rc4

Вышла новая версия winegame.
Собственно, что нового:
- любому приложению можно назначить версию wine от 0.9.7 до текущей.
- куча новых игр по сравнению с rc3
- игры на нескольких дисках.
- система сборки - CMake
- winegame и libwinestuff окончательно разделены.

Доступно для Ubuntu: ppa:pzinin/winegame, а также в официальных репозиториях Agilia Linux


Тэги: release wine winegame
+ 5 -
Похожие Поделиться

razum2um 03.06.2010 22:50 #
геймлист обнови: Updated May 21, 2010 by PZinin
а у меня мой единственный шкурный вопрос: nfs undergroud2 может?
вроде статус голд, dinput8.dll перезаписывал - и нет таки.. хз..
pashazz 03.06.2010 22:59 #
да.
LeXuS 04.06.2010 00:06 #
lexus@lexus-laptop:~$ sudo add-apt-repository ppa:pashazz/winegame

Error reading https://launchpad.net/api/1.0/~pashazz/+archive/winegame: HTTP Error 404: Not Found

???
xtavras 04.06.2010 00:27 #
Правильнo ppa:pzinin/winegame , автор ошибся.
xtavras 04.06.2010 00:34 #
winegame и libwinestuff окончательно разделены.

туплю, но не пойму где брать libwinestuff?
xtavras 04.06.2010 00:38 #
Дочухал, у кого ее нет ставил winestuff0
HellTommy 04.06.2010 13:27 #
Qt`s SQLite module not found вылазит такая ошибка...
Как исправить?
pashazz 04.06.2010 14:01 #
pashazz 04.06.2010 14:02 #
ох, apt-ссылки не обрабатываются.
поставить libqt4-sql-sqlite
pashazz 04.06.2010 13:59 #
надо поставить пакет qt-sqlite (как-то так)
vvorth 08.06.2010 08:56 #
не собирается winestuff-0.1.0-rc4 в opensuse11.2

> make
< 7%> Generating moc_uiclient.cxx
< 14%> Generating moc_corelib.cxx
< 21%> Generating moc_dvdrunner.cxx
< 28%> Generating moc_poldownloader.cxx
< 35%> Generating moc_prefix.cxx
Scanning dependencies of target winestuff
< 42%> Building CXX object src/CMakeFiles/winestuff.dir/corelib.cpp.o
In file included from /home/vvorth/build/winestuff-0.1.0-rc4/src/corelib.cpp:22:
/home/vvorth/build/winestuff-0.1.0-rc4/src/prefix.h:49: error: ‘QProcessEnvironment’ does not name a type
/home/vvorth/build/winestuff-0.1.0-rc4/src/prefix.h:70: error: ‘QProcessEnvironment’ does not name a type
/home/vvorth/build/winestuff-0.1.0-rc4/src/corelib.cpp: In member function ‘void corelib::error(QNetworkReply::NetworkError)’:
/home/vvorth/build/winestuff-0.1.0-rc4/src/corelib.cpp:188: error: ‘ContentReSendError’ is not a member of ‘QNetworkReply’
/home/vvorth/build/winestuff-0.1.0-rc4/src/corelib.cpp: In member function ‘void corelib::runSingleExe(QStringList)’:
/home/vvorth/build/winestuff-0.1.0-rc4/src/corelib.cpp:226: error: ‘QProcessEnvironment’ has not been declared
/home/vvorth/build/winestuff-0.1.0-rc4/src/corelib.cpp:244: error: ‘QProcessEnvironment’ was not declared in this scope
/home/vvorth/build/winestuff-0.1.0-rc4/src/corelib.cpp:244: error: expected ‘;’ before ‘env’
/home/vvorth/build/winestuff-0.1.0-rc4/src/corelib.cpp:245: error: ‘env’ was not declared in this scope
/home/vvorth/build/winestuff-0.1.0-rc4/src/corelib.cpp: In member function ‘QString corelib::config()’:
/home/vvorth/build/winestuff-0.1.0-rc4/src/corelib.cpp:387: error: ‘QProcessEnvironment’ has not been declared
/home/vvorth/build/winestuff-0.1.0-rc4/src/corelib.cpp:388: error: ‘QProcessEnvironment’ has not been declared
make<2>: *** Error 1
make<1>: *** Error 2
make: *** Error 2



pashazz 08.06.2010 15:21 #
Qt 4.6 нужен.
vvorth 08.06.2010 15:26 #
нужен qt-4.6